{"text_format":"1","workbook":"xlsx","n_sheets":4,"sheets":["INSTRUÇÕES","Inquérito de Caracterização","Sub especialidades","--"],"not_rendered":{"charts":0,"images":6,"macros":1,"external_links":0,"defined_names":0,"comments":1,"pivot_tables":0},"unopened":[],"bounds":{"document_bytes":16777216,"sheet_cells":100000,"rows_first":2000,"rows_last":500,"rows_between":2000,"halvings":0,"cell_chars":16384,"cell_head_chars":4096},"cells_cut":0,"cells_raw":0,"read":"whole","date_system":"1900"}

{"sheet":"INSTRUÇÕES","index":0,"n_rows":24,"n_cols":4,"rows_kept":24,"cut":false,"hidden":false,"merged":[[5,1,5,7],[9,3,10,7],[11,3,11,7],[15,1,15,7],[8,1,8,7],[6,1,6,7],[7,1,7,7],[12,1,12,7],[13,1,13,7],[14,2,14,7],[0,1,0,7],[1,1,1,7],[2,1,2,7],[3,1,3,7],[4,1,4,7],[20,1,20,7],[19,1,19,7],[21,1,21,7],[23,1,23,4],[16,1,17,7],[18,1,18,7]]}
[null,"Colégio de Pediatria da Ordem dos Médicos"]
[null,"Inquérito de Caracterização dos Serviços de Pediatria para atribuição de idoneidade formativa para o ano de"]
[null,2026]
[null,"Caro(a) colega"]
[null,{"$f":"\"Enviamos um novo formato de ficheiro (ano \"&B3&\") para recolha dos dados de caracterização dos Serviços de Pediatria para atribuição de Idoneidade Formativa. Antes de iniciar o preenchimento, por favor leia todas as instruções desta página. \"","v":"Enviamos um novo formato de ficheiro (ano 2026) para recolha dos dados de caracterização dos Serviços de Pediatria para atribuição de Idoneidade Formativa. Antes de iniciar o preenchimento, por favor leia todas as instruções desta página. "}]
[null,{"$f":"\"Só serão analisados os inquéritos enviados no corrente formato (versão para o ano \"&B3&\"), não sendo aceites respostas em outros formatos, nomeadamente os utilizados em anos anteriores.\"","v":"Só serão analisados os inquéritos enviados no corrente formato (versão para o ano 2026), não sendo aceites respostas em outros formatos, nomeadamente os utilizados em anos anteriores."}]
[null,{"$f":"\"A informação disponibilizada neste ficheiro destina-se à atribuição de Idoneidades Formativas para o triénio \"&B3 &\"- \"&B3+2&\". A atribuição de idoneidade formativa plurianual pretende permitir aos Serviços programarem a receção de Internos de Formação Específica de forma adequada.\"","v":"A informação disponibilizada neste ficheiro destina-se à atribuição de Idoneidades Formativas para o triénio 2026- 2028. A atribuição de idoneidade formativa plurianual pretende permitir aos Serviços programarem a receção de Internos de Formação Específica de forma adequada."}]
[null,"Esta atribuição não obiva, no entanto, a necessidade de envio do Inquérito anualmente e as Idoneidades atribuídas poderão ser revistas em função da informação disponibilizada, com aplicabilidade imediata, independentemente das idoneidades previamente atribuídas."]
[null,"Para o  preenchimento do mesmo apenas terá que adicionar a informação solicitada em dois tipos de células que mudam de cor assim que preenchidas:"]
[null,"Células de cor LARANJA",null,"Escolher opção da lista disponível. Quando selecionar a célula, surgirá à direita um botão com um triangulo preto, que ao \"clicar\" abrirá o menu de escolha das opções."]
[]
[null,"Células de cor CINZENTA",null,"Introduzir informação numérica ou texto solicitada"]
[null,"Só deve introduzir a informação relevante. Quando não houver informação para o item pretendido, deve deixar a célula sem dados introduzidos que vai permanecer com a cor de formatação original (Laranja ou Cinzento). Os dados estatísticos solicitados dizem respeito aos dois últimos anos de atividade assistencial/científica. Caso não consiga obter os dados para o total do ano indique na célula respetiva o valor apurado e em notas indique o período a que se referem os dados introduzidos."]
[null,"A atribuição INICIAL de idoneidade para outras valências / sub-especialidades, obdece aos critérios definidos pelo Colégio de Pediatria da Ordem dos Médicos, publicados em https://ordemdosmedicos.pt/criterios-de-idoneidade-17/"]
[null,"Pode consultar aqui    ---->>>   ---->>>","Informação para atribuição inicial de idoneidade para outras valências / sub-especialidades"]
[null,"Por razões de segurança e análise dos dados enviados, deverão ser enviados dois ficheiros, um em formato PDF (ACROBAT) e outro em formato XLS ou XLSX (EXCEL)."]
[null,"Antes de iniciar o preenchimento deverá Ativar o Conteúdo (barra amarela em cima). Em algumas versões de Excel pode ser necessário activar os Macros (surgirá informação na barra acima; selecionar opções e \"habilitar o conteúdo\"). Isso é essencial para que o preenchimento decorra normalmente."]
[]
[null,"DEVERÁ GRAVAR ESTE FICHEIRO NO AMBIENTE DE TRABALHO com o nome do seu hospital após o título atual (ex: Inquérito de avaliação idoneidade_CHXXXXX) antes de iniciar o preenchimento do mesmo. No final do preenchimento clique no ícone com o desenho de uma disquete. Será automaticamente criado um ficheiro PDF no Ambiente de Trabalho do seu computador com o mesmo nome."]
[null,"Após o preenchimento, os 2 ficheiros do inquérito (pdf e xls) e respectivos anexos, devem ser enviados via Internato Médico do seu hospital para o CRIM respetivo, como habitual em anos anteriores. Por segurança sugerimos que peça confirmação de recepção ou \"recibo eletrónico\" de entrega da mensagem."]
[null,"Solicitamos que envie em simultaneo para os endereços de correrio eletronico da Ordem dos Médicos  colegios@ordemdosmedicos.pt e pediatria@colegiosordemdosmedicos.pt, que permitirá maior celeridade no processamento da informação."]
[null,"Ao enviar o PDF (ACROBAT) gerado para o email (Internato Médico do Hospital e/ou CRIM), é considerado que a resposta ao inquérito se encontra validada pelo Diretor do Serviço na data e hora inscrita no ficheiro."]
[]
[null,"Clique aqui para iniciar o preenchimento"]

{"sheet":"Inquérito de Caracterização","index":1,"n_rows":237,"n_cols":19,"rows_kept":237,"cut":false,"hidden":false,"merged":[[231,1,231,8],[189,1,189,8],[198,5,198,7],[199,5,199,7],[200,5,200,7],[201,5,201,7],[198,1,198,4],[199,1,199,4],[200,1,200,4],[201,1,201,4],[202,5,202,7],[203,5,203,7],[210,2,210,4],[210,5,210,7],[211,2,211,4],[211,5,211,7],[202,1,202,4],[203,1,203,4],[212,2,212,4],[212,5,212,7],[219,1,219,8],[213,2,213,4],[213,5,213,7],[214,2,214,4],[214,5,214,7],[215,2,215,4],[215,5,215,7],[218,1,218,8],[222,1,222,8],[227,1,227,8],[228,1,228,8],[229,1,229,8],[230,1,230,8],[0,1,0,8],[1,1,1,8],[2,1,2,8],[3,1,3,7],[4,7,4,8],[10,2,10,8],[11,2,11,8],[12,2,12,8],[16,1,16,8],[17,2,17,6],[76,1,76,8],[45,4,45,7],[53,2,53,7],[26,2,26,6],[33,1,33,7],[35,1,35,8],[37,4,41,6],[44,1,44,8],[73,1,74,7],[77,1,77,2],[85,1,85,2],[85,3,85,8],[86,3,86,6],[90,1,90,2],[90,3,90,8],[102,3,102,8],[103,3,103,8],[107,2,108,8],[95,3,95,8],[97,1,97,8],[99,3,99,8],[100,3,100,8],[101,3,101,8],[104,3,104,8],[105,3,105,8],[106,2,106,8],[127,1,127,8],[148,4,149,4],[148,5,149,5],[110,1,110,8],[111,1,112,1],[119,1,119,8],[120,1,120,8],[133,1,133,8],[141,1,141,8],[146,1,146,8],[147,3,147,4],[147,5,147,6],[147,7,148,8],[148,3,149,3],[148,6,149,6],[114,2,114,5],[154,1,156,1],[154,3,154,4],[154,5,154,6],[154,7,155,8],[155,3,156,3],[155,4,156,4],[155,5,156,5],[155,6,156,6]]}
[null,"Colégio de Pediatria da Ordem dos Médicos"]
[null,"Inquérito de Caracterização dos Serviços de Pediatria para atribuição de idoneidade formativa"]
[null,{"$f":"\"Ano \"&INSTRUÇÕES!B3","v":"Ano 2026"}]
[null,"Preencher apenas as células côr de LARANJA (opções) e CINZENTA (números/texto)"]
[null,null,null,null,null,null,null,{"$f":"NOW()","v":"2025-02-07T11:35:48.870"}]
[null,"Região de Saúde"]
[]
[null,"Centro Hospitalar / Unidade Local de Saúde",{"$f":"IF($B$9=\"outro\",\"Por favor introduza na celula abaixo o nome do seu hospital\",\"\")","v":""}]
[null,null,null,null,null,null,null,{"$f":"IF(B9=\"\",\"\",VLOOKUP(B9,'--'!G3:H43,2,))","v":""}]
[null,"Serviço de Pediatria"]
[null,"Diretor(a) do Serviço"]
[null,"Correio eletrónico/email"]
[null,"Telefone"]
[]
[null,{"$f":"\"As informações reportadas neste inquerito (para o ano de \"&INSTRUÇÕES!B3&\") alteram substancialmente a Capacidade Formativa do Serviço, relativamenta ao previsto para o ano anterior (\"&INSTRUÇÕES!B3-1&\")?\"","v":"As informações reportadas neste inquerito (para o ano de 2026) alteram substancialmente a Capacidade Formativa do Serviço, relativamenta ao previsto para o ano anterior (2025)?"}]
[]
[null,"1. Médicos colocados no Serviço e com trabalho efetivo na Instituição"]
[null,{"$f":"\"Dados relativos a 2 de dezembro de \"&INSTRUÇÕES!$B$3-2","v":"Dados relativos a 2 de dezembro de 2024"},"Horário semanal"]
[null,null,"42 h","40 h","35 h","20 h","Outro",null,"Total",null,null,null,"S/N","Triagem","Unidade","Na Insituição onde fazem o estágio opcional","Apoio Perinatal","semanal"]
[null,"Nº Assistentes Hospitalares Graduados Sénior (AHGS) na Pediatria *",null,null,null,null,null,null,{"$f":"SUM(C20:G20)","v":0},null,null,null,"Sim","Não",null,"Sempre no seu Hospital de acolhimento (Hospital de colocação inicial)","Apoio Perinatal Diferenciado","bissemanal"]
[null,"Nº Assistentes Hospitalares Graduados (AHG) na Pediatria *",null,null,null,null,null,null,0,null,null,null,"Não","Manchester","Não","No seu Hospital de acolhimento (hospital de colocação inicial) se a distância <50km entre as duas instituições","Apoio Perinatal Altamente Diferenciado","quinzenal"]
[null,"Nº Assistentes Hospitalares (AH) na Pediatria *",null,null,null,null,null,null,0,null,null,null,"Não aplicavel","Canadiana","Intensivos",null,null,"mensal"]
[null,"Nº Especialistas em Contrato de Prestação na Serviços (CPS) *",null,null,null,null,null,null,0,null,null,null,null,"Outra","Intermedios",null,null,"outra"]
[null,"Total",{"$f":"SUM(C20:C23)","v":0},0,0,0,0,null,{"$f":"SUM(I20:I23)","v":0}]
[null,"* Não incluir os profissionais alocados à Perinatologia/Neonatologia/UCIN"]
[]
[null,{"$f":"\"Dados relativos a 2 de dezembro de \"&INSTRUÇÕES!$B$3-2","v":"Dados relativos a 2 de dezembro de 2024"},"Horário semanal"]
[null,null,"42 h","40 h","35 h","20 h","Outro",null,"Total"]
[null,"Nº AHGS alocados à Perinatologia/Neonatologia/UCIN",null,null,null,null,null,null,{"$f":"SUM(C29:G29)","v":0}]
[null,"Nº AHG alocados à Perinatologia/Neonatologia/UCIN",null,null,null,null,null,null,0]
[null,"Nº AH alocados à Perinatologia/Neonatologia/UCIN",null,null,null,null,null,null,0]
[null,"Nº Especialistas em CPS alocados à Perinatologia/Neonatologia/UCIN",null,null,null,null,null,null,0]
[null,"Total",{"$f":"SUM(C29:C32)","v":0},0,0,0,0,null,{"$f":"SUM(I29:I32)","v":0}]
[]
[]
[null,"1.1 Internos de Formação Especifica em Pediatria (IFEP)"]
[null,{"$f":"\"Dados relativos a 2 de dezembro de \"&INSTRUÇÕES!$B$3-2","v":"Dados relativos a 2 de dezembro de 2024"},"Da própria instituição"]
[null,"1º ano",null,null,{"$f":"\"Contabilizar todos os internos do Serviço a 2 de dezembro de \"&INSTRUÇÕES!B3-2&\" , mesmo os que estão a fazer estágios em outras instituições, que não a de colocação inicial (hospital de acolhimento).\"","v":"Contabilizar todos os internos do Serviço a 2 de dezembro de 2024 , mesmo os que estão a fazer estágios em outras instituições, que não a de colocação inicial (hospital de acolhimento)."}]
[null,"2º ano"]
[null,"3º ano"]
[null,"4º ano"]
[null,"5º ano"]
[null,"Total",{"$f":"SUM(C38:C42)","v":0}]
[]
[null,"2. Estágios pretendidos e idoneidades para IFEP"]
[null,null,null,null,{"$f":"\"Caracterização da Área de formação - dados de \"&INSTRUÇÕES!B3-2","v":"Caracterização da Área de formação - dados de 2024"}]
[null,null,{"$f":"\"Número máximo de internos em Simultâneo por Estágio que tiveram em \"&INSTRUÇÕES!$B$3-2","v":"Número máximo de internos em Simultâneo por Estágio que tiveram em 2024"},{"$f":"\"Número máximo de internos em Simultâneo por Estágio pretendidos para \"&INSTRUÇÕES!$B$3","v":"Número máximo de internos em Simultâneo por Estágio pretendidos para 2026"},"Número de Médicos com Dedicação à Área (mínimo de 20h semanias dedicadas por especialista)","Número de Médicos com Sub-especialidade/Ciclo de Estudos Especiais/Equivalência a CEE na Área","Número de Horas de Consulta Semanal da Área","Realização de Técnicas de Diagnóstico/Terapêuticas na instituição","Variação",null,null,null,null,null,null,null,null,null,"Indicar o somatório de todas as horas em consulta efetuado por todos os médicos da área."]
[null,"Pediatria Geral 1 da própria instituição (13m)",null,null,null,null,null,null,{"$f":"D48-C48","v":0}]
[null,"Pediatria Geral 2 da própria instituição (12m)",null,null,null,null,null,null,0]
[null,"Pediatria Geral 2 de outra instituição (12m)",null,null,null,null,null,null,0]
[null,"Bloco de Partos e Cuidados Perinatais (3 m)",null,null,null,null,null,null,0]
[null,"Cuidados Intensivos Neonatais (3m)",null,null,null,null,null,null,0]
[null,"Cuidados Intensivos Pediatricos (3m)",null,null,null,null,null,null,0]
[]
[null,"Alergologia Pediátrica (3m)",null,null,null,null,null,null,{"$f":"D55-C55","v":0}]
[null,"Doenças Hereditárias do Metabolismo (3m)",null,null,null,null,null,null,0]
[null,"Endocrinologia Pediátrica (3m)",null,null,null,null,null,null,0]
[null,"Gastrenterologia e Hepatologia Pediátrica (3m)",null,null,null,null,null,null,0]
[null,"Hematologia Pediátrica (3m)",null,null,null,null,null,null,0]
[null,"Medicina do Adolescente (3m)",null,null,null,null,null,null,0]
[null,"Nefrologia Pediátrica (3m)",null,null,null,null,null,null,0]
[null,"Neurodesenvolvimento (3m)",null,null,null,null,null,null,0]
[null,"Neuropediatria (3m)",null,null,null,null,null,null,0]
[null,"Oncologia Pediátrica (3m)",null,null,null,null,null,null,0]
[null,"Pneumologia Pediátrica e Sono (3m)",null,null,null,null,null,null,0]
[null,null,null,null,null,null,null,null,{"$f":"D66-C66","v":0}]
[null,null,null,null,null,null,null,null,0]
[null,null,null,null,null,null,null,null,0]
[null,null,null,null,null,null,null,null,0]
[null,null,null,null,null,null,null,null,0]
[null,"Cirurgia Pediátrica (1m)"]
[null,"Ortopedia Pediatrica (1m)"]
[]
[null,"Nota: Candidaturas INICIAIS para outras valências / sub especialidades devem seguir os critérios de atribuição de idoneidade, que podem ser consultados no separador \"Sub especialidades\""]
[]
[]
[null,"3. Instalações e apoios complementares"]
[null,"3.1 Internamento",null,"3.4 Disponibilidade de MCDTs",null,null,null,null,"7x365 d"]
[null,"Número total de camas de internamento de Pediatria Médica",null,null,null,null,"Patologia clínica"]
[null,"Número de camas em quartos individuais",null,null,null,null,"Imunohemoterapia"]
[null,"Quarto para isolamento",null,null,null,null,"Radiologia convencional"]
[null,"Unidade de adolescentes individualizada",null,null,null,null,"Ecografia"]
[null,"Número de camas para adolescentes",null,null,null,null,"Acesso a TAC"]
[null,"Salas de atividades lúdicas separadas por grupos etários",null,null,null,null,"Acesso a RMN"]
[null,"Idade (anos) limite dos doentes internados"]
[null,"3.2 Consulta Externa",null,"3.5 Hospital de Dia"]
[null,"Idade (anos) limite dos doentes admitidos na Consulta Pediátrica",null,"O Serviço tem Hospital de Dia pediátrico"]
[null,"Área especifica para a Pediatria"]
[null,"Sala de espera exclusiva da Pediatria"]
[null,"Sala de preparação de consulta (enfermagem)"]
[null,"3.3 Urgência"]
[null,"Urgência Pediátrica individualizada dos adultos"]
[null,"Idade (anos) limite dos doentes admitidos na Urgência Pediátrica"]
[null,"Sala de espera exclusiva da Pediatria"]
[null,"UICD/SO"]
[null,"Número de camas UICD/SO"]
[]
[null,"4. Serviço de Urgência Pediatria Geral - recursos médicos"]
[null,null,null,"Obs"]
[null,"Total de horas da equipa tipo de urgência por dia"]
[null,"Horas em presença física (PF) por dia"]
[null,"Horas em prevenção por dia"]
[null,"Horas da equipa tipo asseguradas exclusivamente por Pediatras"]
[null,"Horas da equipa tipo asseguradas por Internos"]
[null,"Número de Pediatras (especialistas em PF) durante o dia (8:00-20:00)"]
[null,"Número de Pediatras (especialistas em PF) durante a noite (20:00-8:00)"]
[null,"Os Internos da sua Instituição, a fazer estágios opcionais em outra instituição, por regra, cumprem as horas de urgência:"]
[null,"Observações / comentários"]
[]
[]
[null,"5. Neonatologia"]
[null,null,"Intensivos","Intermédios"]
[null,null,null,null,"(Sim/Não)"]
[null,"Nº de camas"]
[null,"Unidade de Neonatologia integra a Rede de Referenciação Perinatal como Hospital de :"]
[null,"Equipa Médica individualizada exclusiva para apoio neonatal nas 24 h"]
[null,"Pediatra em presença física nas 24h, com competência em reanimação e estabilização de Recém-Nascidos"]
[null,"Pediatra / Neonatologista em todos os partos"]
[]
[null,"6. Indicadores de movimento assistencial"]
{"$rows_left_out":118}
{"sheet":"Sub especialidades","index":2,"n_rows":10,"n_cols":6,"rows_kept":10,"cut":false,"hidden":false,"merged":[[9,5,9,8],[0,1,0,8],[1,1,1,8],[2,1,2,8],[5,1,5,8],[4,1,4,8]]}
[null,"Colégio de Pediatria da Ordem dos Médicos"]
[null,"Inquérito de Caracterização dos Serviços de Pediatria para atribuição de idoneidade formativa"]
[null,{"$f":"\"Ano \"&INSTRUÇÕES!B3","v":"Ano 2026"}]
[]
[null,"Idoneidade para Outras valências / subespecialidades"]
[null,"Candidatura Inicial"]
[]
[null,"Página 4  dos \"Critérios para Atribuição de Idoneidade e Capacidades Formativas em Serviços de Pediatria das Instituições de Colocação"]
[null,"Disponível em:"]
[null,"Critérios de idoneidade – Ordem dos Médicos (ordemdosmedicos.pt)",null,null,null,"Voltar para \"INSTRUÇÕES\""]

{"sheet":"--","index":3,"n_rows":270,"n_cols":21,"rows_kept":270,"cut":false,"hidden":false,"merged":[[17,2,24,4]]}
[]
[null,"Região Saúde",null,"S/N",null,null,"Hospital"]
[null,"Norte (ARS)",null,"Sim",null,null,"CH Baixo Vouga ","Aveiro",null,"Esta folha, não é de preenchimento. Os dados visiveis são extraidos automaticamente"]
[null,"Centro (ARS)",null,"Não",null,null,"CH Barreiro-Montijo","Barreiro",null,"Tem valores informativos de compilação, não editáveis"]
[null,"Lisboa e Vale do Tejo (ARS)",null,"Não aplicável",null,null,"CH Setúbal","Setúbal"]
[null,"Alentejo (ARS)",null,"Sim, em horário exclusivo",null,null,"CH Trás-os-Montes e Alto Douro","Vila Real"]
[null,"Algarve (ARS)",null,"Sim, dando apoio apenas",null,null,"CH Vila Nova de Gaia/Espinho","VN Gaia",null,"Este inquérito é preenchido no ano:"]
[null,"SRS RA Madeira",null,"Não",null,null,"CH Médio Ave","VN Famalicão",null,2024]
[null,"SRS RA Açores",null,null,null,null,"CH Médio Tejo","Torres Novas / Abrantes"]
[null,null,null,"Horário parcial",null,null,"CH Oeste","Caldas da Rainha",null,"Refere-se à atribuição de idoneidades para:"]
[null,"Sistema Triagem",null,"24 h",null,null,"CH Entre Douro e Vouga","Feira",null,2025]
[null,"Não",null,"Não disponível",null,null,"CH Leiria","Leiria"]
[null,"Manchester",null,null,null,null,"CH Lisboa Ocidental","HS F Xavier",null,"Compilação de dados de movimento assistencial do Serviço:"]
[null,"Canadiano",null,null,null,null,"CH Póvoa Varzim-Vila do Conde","Póvoa de Varzim",null,{"$f":"J8-2","v":2022},null,null,{"$f":"IF('Inquérito de Caracterização'!C123=0,\"??\",'Inquérito de Caracterização'!C123)","v":"??"},{"$f":"IF('Inquérito de Caracterização'!C130=0,\"??\",'Inquérito de Caracterização'!C130)","v":"??"},{"$f":"IF('Inquérito de Caracterização'!D151=0,\"??\",'Inquérito de Caracterização'!D151)","v":"??"},{"$f":"IF(SUM('Inquérito de Caracterização'!D151:D178)=0,\"??\",SUM('Inquérito de Caracterização'!D151:D178))","v":2023},{"$f":"IF('Inquérito de Caracterização'!C136=0,\"??\",'Inquérito de Caracterização'!C136)","v":"??"},{"$f":"J15","v":2023},{"$f":"IF('Inquérito de Caracterização'!C48=0,\"??\",'Inquérito de Caracterização'!C48)","v":"??"},{"$f":"IF('Inquérito de Caracterização'!C49=0,\"??\",'Inquérito de Caracterização'!C49)","v":"??"},{"$f":"IF('Inquérito de Caracterização'!C50=0,\"??\",'Inquérito de Caracterização'!C50)","v":"??"}]
[null,"Outro",null,null,null,null,"CH Tâmega e Sousa","Penafiel",null,{"$f":"J8-1","v":2023},{"$f":"IF(SUM('Inquérito de Caracterização'!C24:E24)=0,\"??\",SUM('Inquérito de Caracterização'!C24:E24))","v":"??"},{"$f":"IF('Inquérito de Caracterização'!C79=0,\"??\",'Inquérito de Caracterização'!C79)","v":"??"},{"$f":"IF('Inquérito de Caracterização'!E123=0,\"??\",'Inquérito de Caracterização'!E123)","v":"??"},{"$f":"IF('Inquérito de Caracterização'!E130=0,\"??\",'Inquérito de Caracterização'!E130)","v":"??"},{"$f":"IF('Inquérito de Caracterização'!F151=0,\"??\",'Inquérito de Caracterização'!F151)","v":"??"},{"$f":"IF(SUM('Inquérito de Caracterização'!F151:F178)=0,\"??\",SUM('Inquérito de Caracterização'!F151:F178))","v":2024},{"$f":"IF('Inquérito de Caracterização'!E136=0,\"??\",'Inquérito de Caracterização'!E136)","v":"??"},{"$f":"J11","v":2025},{"$f":"IF('Inquérito de Caracterização'!D48=0,\"??\",'Inquérito de Caracterização'!D48)","v":"??"},{"$f":"IF('Inquérito de Caracterização'!D49=0,\"??\",'Inquérito de Caracterização'!D49)","v":"??"},{"$f":"IF('Inquérito de Caracterização'!D50=0,\"??\",'Inquérito de Caracterização'!D50)","v":"??"}]
[null,null,null,null,null,null,"CH Tondela Viseu","Viseu",null,null,"Especialistas com mais de 35 horas de trabalho","Total de camas de enfemraria de Pediatria","Total de internamentos","Total de admissões na Urgência","Total de primeiras consultas de Pediatria Geral","Total de primeiras consultas de Pediatria e subespecialidades","Total de partos",null,{"$f":"'Inquérito de Caracterização'!B48","v":"Pediatria Geral 1 da própria instituição (13m)"},{"$f":"'Inquérito de Caracterização'!B49","v":"Pediatria Geral 2 da própria instituição (12m)"},{"$f":"'Inquérito de Caracterização'!B50","v":"Pediatria Geral 2 de outra instituição (12m)"}]
[null,null,null,null,null,null,"CHU Cova da Beira","Covilhã"]
[null,null,null,null,null,null,"CHU de Coimbra","HP Coimbra"]
[null,null,null,null,null,null,"CHU de Lisboa Central","HD Estefânia"]
[null,null,null,null,null,null,"CHU de Lisboa Norte","HS Maria"]
[null,null,null,null,null,null,"CHU de S. João","Porto"]
[null,null,null,null,null,null,"CHU do Algarve","Faro"]
[null,null,null,null,null,null,"CHU do Porto","CMIN"]
[null,null,null,null,null,null,"Hospital Beatriz Ângelo","Loures"]
[null,null,null,null,null,null,"Hospital Central do Funchal","Funchal"]
[null,null,null,null,null,null,"Hospital CUF Descobertas","Lisboa"]
[null,{"$f":"NOW()","v":"2025-02-07T11:35:48.870"},"Agora",null,null,null,"Hospital Senhora da Oliveira Guimarães","Guimarães"]
[null,{"$f":"YEAR(B27)","v":2025},"Ano",null,null,null,"Hospital Braga","Braga"]
[null,{"$f":"MONTH(B27)","v":2},"Mês",null,null,null,"Hospital Cascais Dr José Almeida","Cascais"]
[null,{"$f":"DAY(B27)","v":7},"Dia",null,null,null,"Hospital da Luz","Lisboa"]
[null,{"$f":"HOUR(B27)","v":11},"Hora",null,null,null,"Hospital Santarém","Santarém"]
[null,{"$f":"MINUTE(B27)","v":35},"Minuto",null,null,null,"Hospital Vila Franca de Xira","V F Xira"]
[null,{"$f":"WEEKDAY(B27)","v":6},"Dia da semana",null,null,null,"Hospital Distrital da Figueira da Foz","Figueira da Foz"]
[null,{"$f":"VLOOKUP(B33,B36:C42,2)","v":"Sexta-feira"},"Dia da semana",null,null,null,"Hospital Divino Espírito Santo – Ponta Delgada ","Ponta Delgada"]
[null,{"$f":"VLOOKUP(MONTH(B27),B44:C55,2)","v":"fevereiro"},"Mês do ano",null,null,null,"Hospital Espírito Santo Évora","Évora"]
[null,1,"Domingo",null,null,null,"Hospital Garcia d'Orta","Alamada"]
[null,2,"Segunda-feira",null,null,null,"Hospital Prof Dr Fernando Fonseca","Lisboa"]
[null,3,"Terça-feira",null,null,null,"ULS Guarda","Guarda"]
[null,4,"Quarta-feira",null,null,null,"ULS Castelo Branco","Castelo Branco"]
[null,5,"Quinta-feira",null,null,null,"ULS Alto Minho","Viana do Castelo"]
[null,6,"Sexta-feira",null,null,null,"ULS Baixo Alentejo","Beja"]
[null,7,"Sábado",null,null,null,"ULS Matosinhos","Matosinhos"]
[null,null,null,null,null,null,"Outro","<--<--"]
[null,1,"janeiro"]
[null,2,"fevereiro"]
[null,3,"março"]
[null,4,"abril"]
[null,5,"maio"]
[null,6,"junho"]
[null,7,"julho"]
[null,8,"agosto"]
[null,9,"setembro"]
[null,10,"outubro"]
[null,11,"novembro"]
[null,12,"dezembro"]
[]
[]
[]
[]
[]
[]
[]
[]
[]
[]
[]
[]
[]
[]
[]
[]
[]
[]
[]
[]
[]
[]
[]
[]
[]
[]
[]
[]
[]
[]
[]
[]
[]
[]
[]
[]
[]
[]
[]
[]
[]
[]
[]
[]
[]
[]
[]
[]
[]
[]
[]
[]
[]
[]
[]
[]
[]
[]
[]
[]
[]
[]
[]
[]
[]
{"$rows_left_out":150}